{"text_format":"1","workbook":"xlsx","n_sheets":5,"sheets":["Instructions","Information","Report","Sample Data","Data"],"not_rendered":{"charts":3,"images":10,"macros":1,"external_links":1,"defined_names":8,"comments":0,"pivot_tables":0},"unopened":[],"bounds":{"document_bytes":16777216,"sheet_cells":100000,"rows_first":2000,"rows_last":500,"rows_between":2000,"halvings":0,"cell_chars":16384,"cell_head_chars":4096},"cells_cut":0,"cells_raw":0,"read":"whole","date_system":"1900"}

{"sheet":"Instructions","index":0,"n_rows":176,"n_cols":9,"rows_kept":176,"cut":false,"hidden":false,"merged":[[0,0,0,8],[109,0,109,1],[110,0,110,1],[111,0,111,1]]}
["Instructions"]
[]
["Fill out the \"Information\" form and apply the units of measure."]
[]
[]
[]
[]
[]
[]
[]
[]
[]
[]
[]
[]
[]
[]
[]
[]
[]
[]
[]
["Enter the Machine Settings and Criteria/Tolerance on the \"Report\" worksheet. All settings "]
["can be adjusted pre/post opperation."]
[]
[]
[]
[]
[]
[]
[]
[]
[]
[]
[]
[]
[]
[]
[]
[]
[]
[]
[]
["Open Accu-Gold 2 and activate \"Companion Mode\""]
[]
[]
[]
[]
[]
[]
[]
[]
[]
[]
[]
[]
[]
["If the software is already open you can just click the \"Toggle\" button"]
[]
[]
[]
[]
[]
[]
[]
[]
[]
[]
[]
[]
[]
[]
[]
[]
["Accu-Gold 2 will automatically re-size the template and application so they can be viewed"]
["simultaneously. "]
[]
["Select the unit of measure. Units can be adjusted pre/post operation. "]
[]
[]
[]
[]
[]
[]
[]
[]
[]
[]
[]
[]
[]
[]
[]
[]
[]
[]
[]
[]
["On Accu-Gold 2 adjust the \"Direct Link to Excel\" options to \"Nordic Format\" and check the"]
["box for \"Auto Send\""]
[]
[]
[]
[]
[]
[]
[]
[]
["You can now select the first output cell on the \"Data\" sheet"]
["Reproducibility",null,"\"D3\""]
["Accuracy ",null,"\"D14\""]
["Linearity ",null,"\"D25\""]
[]
["All test sections can be used in any order of choice by selecting"]
["the appropriate start cell. "]
[]
["The test data can be deleted from each section independently by clicking"]
["the button to the right of the section."]
[]
[]
[]
[]
[]
[]
[]
[]
[]
[]
[]
[]
[]
[]
[]
[]
[]
[]
[]
["After the cell has been selected go to the Accu-Gold 2 \"Direct Link to Excel\" options and"]
["click \"Get Cell\". The selected cell and template name will show in the same field."]
[]
[]
[]
[]
[]
[]
[]
[]
[]
[]
["You can now click the \"Start\" button and begin taking measurement."]
[]
[]
[]
[]
[]
[]
[]
[]
[]
[]
[]
[]
["Notes:"]
[]
["When you have competed the inspection it is recommended you save as a PDF instead of "]
["saving over the original template."]
[]
["You can capture data a review the \"Data\" or \"Report\" sheet as needed."]
[]
["Stopping Accu-Gold 2 to \"Get Cell\" is not required"]
[]
["\"Direct Link to Excel\" will work with both USB and Wifi connectivity "]
[]
["\"Data\" output can be entered manually"]
[]
["For assistance contact cust_sup@radcal.com",null,null,null,null,null,null,null,"2017-05-09"]

{"sheet":"Information","index":1,"n_rows":28,"n_cols":14,"rows_kept":28,"cut":false,"hidden":false,"merged":[[19,2,19,11],[1,1,1,10],[7,3,7,7],[9,3,9,7],[11,3,11,7],[13,3,13,7],[15,3,15,7],[17,3,17,7]]}
[null,null,null,null,null,null,null,null,null,null,null,"mA","mR/","cm"]
[null,null,null,null,null,null,null,null,null,null,null,"mAs","mGy/","in"]
[]
[]
[]
[null,null,"User Information"]
[]
[null,null,"Facility","Confidential"]
[]
[null,null,"Location","Top Secret"]
[]
[null,null,"Room","Somewhere on the 3rd floor"]
[]
[null,null,"Machine","Pegasus 3000"]
[]
[null,null,"Technician","John Smith"]
[]
[null,null,"Date","5/4/1983"]
[]
[null,null,"Settings"]
[]
[null,null,"SDD:",12]
[]
[null,null,"SDD Units:","cm"]
[]
[null,null,"Dose Units:","mR/"]
[]
[null,null,"Time Generator:","mA"]

{"sheet":"Report","index":2,"n_rows":114,"n_cols":15,"rows_kept":114,"cut":false,"hidden":false,"merged":[[0,0,0,14],[70,0,70,14],[71,0,71,14],[2,2,2,6],[3,2,3,6],[4,2,4,6],[5,2,5,6],[6,2,6,6],[7,2,7,6],[9,1,9,2],[31,0,31,14],[9,4,9,6],[43,0,43,3],[30,0,30,14],[69,0,69,14],[32,0,32,14],[33,0,33,14],[44,13,44,14],[43,9,43,11],[43,5,43,7],[86,12,86,13],[82,8,82,10],[82,4,82,6],[72,0,72,14],[79,2,79,6],[75,2,75,6],[76,2,76,6],[77,2,77,6],[78,2,78,6],[36,2,36,6],[37,2,37,6],[38,2,38,6],[80,2,80,6],[34,0,34,14],[113,0,113,14],[111,0,111,14],[112,0,112,14],[87,12,87,13],[110,0,110,14],[105,0,105,14],[39,2,39,6],[40,2,40,6],[41,2,41,6],[73,0,73,14]]}
["Radiographic Reproducibility"]
[]
[null,"Facility:",{"$f":"Information!D8","v":"Confidential"}]
[null,"Location:",{"$f":"Information!D10","v":"Top Secret"}]
[null,"Room:",{"$f":"Information!D12","v":"Somewhere on the 3rd floor"}]
[null,"Machine:",{"$f":"Information!D14","v":"Pegasus 3000"}]
[null,"Technician:",{"$f":"Information!D16","v":"John Smith"}]
[null,"Date:",{"$f":"Information!D18","v":"5/4/1983"}]
[]
[null,"Machine Settings",null,null,"Measurement Data"]
[null,"kV",80,"Exp.","kVp","ms",{"$f":"Information!D26","v":"mR/"}]
[null,{"$f":"Information!D28","v":"mA"},20,1,{"$f":"IF(Data!D3=\"\",\"\",Data!D3)","v":79.3},{"$f":"IF(Data!J3=\"\",\"\",Data!J3)*1000","v":100},{"$f":"IF(Data!F3=\"\",\"\",Data!F3)","v":189.07}]
[null,"Focus","Small",2,{"$f":"IF(Data!D4=\"\",\"\",Data!D4)","v":78},{"$f":"IF(Data!J4=\"\",\"\",Data!J4)*1000","v":100},{"$f":"IF(Data!F4=\"\",\"\",Data!F4)","v":189.99}]
[null,"SDD",{"$f":"Information!D22","v":12},3,{"$f":"IF(Data!D5=\"\",\"\",Data!D5)","v":77.2},{"$f":"IF(Data!J5=\"\",\"\",Data!J5)*1000","v":100},{"$f":"IF(Data!F5=\"\",\"\",Data!F5)","v":187.56}]
[null,null,null,4,{"$f":"IF(Data!D6=\"\",\"\",Data!D6)","v":77.8},{"$f":"IF(Data!J6=\"\",\"\",Data!J6)*1000","v":100},{"$f":"IF(Data!F6=\"\",\"\",Data!F6)","v":189.99}]
[null,null,null,5,{"$f":"IF(Data!D7=\"\",\"\",Data!D7)","v":78.5},{"$f":"IF(Data!J7=\"\",\"\",Data!J7)*1000","v":100},{"$f":"IF(Data!F7=\"\",\"\",Data!F7)","v":189.07}]
[null,null,null,6,{"$f":"IF(Data!D8=\"\",\"\",Data!D8)","v":79.3},{"$f":"IF(Data!J8=\"\",\"\",Data!J8)*1000","v":100},{"$f":"IF(Data!F8=\"\",\"\",Data!F8)","v":189.99}]
[null,null,null,7,{"$f":"IF(Data!D9=\"\",\"\",Data!D9)","v":79.599999999999994},{"$f":"IF(Data!J9=\"\",\"\",Data!J9)*1000","v":100},{"$f":"IF(Data!F9=\"\",\"\",Data!F9)","v":187.56}]
[null,null,null,8,{"$f":"IF(Data!D10=\"\",\"\",Data!D10)","v":79.099999999999994},{"$f":"IF(Data!J10=\"\",\"\",Data!J10)*1000","v":100},{"$f":"IF(Data!F10=\"\",\"\",Data!F10)","v":189.99}]
[null,null,null,9,{"$f":"IF(Data!D11=\"\",\"\",Data!D11)","v":79.5},{"$f":"IF(Data!J11=\"\",\"\",Data!J11)*1000","v":100},{"$f":"IF(Data!F11=\"\",\"\",Data!F11)","v":189.07}]
[null,null,null,10,{"$f":"IF(Data!D12=\"\",\"\",Data!D12)","v":80.5},{"$f":"IF(Data!J12=\"\",\"\",Data!J12)*1000","v":100},{"$f":"IF(Data!F12=\"\",\"\",Data!F12)","v":187.56}]
[]
[null,null,null,"Average",{"$f":"IF(ISNUMBER(E12), AVERAGE(E12:E21), \"\")","v":78.88000000000001},{"$f":"IF(ISNUMBER(F12), AVERAGE(F12:F21), \"\")","v":100},{"$f":"IF(ISNUMBER(G12), AVERAGE(G12:G21), \"\")","v":188.98499999999999}]
[null,null,null,"Coefficient of Variation",{"$f":"IF(AND(ISNUMBER(E12),ISNUMBER(E13)), STDEV(E12:E21)/AVERAGE(E12:E21), \"\")","v":1.2561447771121843E-2},{"$f":"IF(AND(ISNUMBER(F12),ISNUMBER(F13)), STDEV(F12:F21)/AVERAGE(F12:F21), \"\")","v":0},{"$f":"IF(AND(ISNUMBER(G12),ISNUMBER(G13)), STDEV(G12:G21)/AVERAGE(G12:G21), \"\")","v":5.6203389128309808E-3}]
[]
[null,null,null,"Pass/Fail Criteria",0.05,0.05,0.05]
[null,null,null,"Pass/Fail Results",{"$f":"IF(ISNUMBER(E24), IF(E24>$E$26,\"FAIL\",\"PASS\"), \"\")","v":"PASS"},{"$f":"IF(ISNUMBER(F24), IF(F24>$F$26,\"FAIL\",\"PASS\"), \"\")","v":"PASS"},{"$f":"IF(ISNUMBER(G24), IF(G24>$G$26,\"FAIL\",\"PASS\"), \"\")","v":"PASS"}]
[]
[]
[]
["Comments:"]
[]
["Signature:"]
["Page 1 of 3"]
["Radiographic Accuracy"]
[]
[null,{"$f":"\"Facility:\"","v":"Facility:"},{"$f":"Information!D8","v":"Confidential"}]
[null,{"$f":"\"Location:\"","v":"Location:"},{"$f":"Information!D10","v":"Top Secret"}]
[null,{"$f":"\"Room:\"","v":"Room:"},{"$f":"Information!D12","v":"Somewhere on the 3rd floor"},null,null,null,null,null,0]
[null,{"$f":"\"Machine:\"","v":"Machine:"},{"$f":"Information!D14","v":"Pegasus 3000"},null,null,null,null,null,0]
[null,{"$f":"\"Technician:\"","v":"Technician:"},{"$f":"Information!D16","v":"John Smith"}]
[null,{"$f":"\"Date:\"","v":"Date:"},{"$f":"Information!D18","v":"5/4/1983"},null,null,null,null,null,null,null,null,null,null,"kVp","Time"]
[null,null,null,null,null,null,null,null,null,null,null,null,null,0.05,0.05]
["Machine Settings",null,null,null,null,"Measurement Data",null,null,null,"Error"]
["SDD:",{"$f":"Information!D22","v":12},{"$f":"Information!D24","v":"cm"},null,null,null,null,null,null,"Percent","Absolute","Percent",null,"Pass/Fail Results"]
["kVp",{"$f":"Information!D28","v":"mA"},"Focus","ms","Exp.","kVp","ms",{"$f":"Information!D26","v":"mR/"},null,"kVp","kV Error","Time",null,"kVp","time"]
[50,100,"Small",100,1,{"$f":"IF(Data!D14=\"\",\"\",Data!D14)","v":52},{"$f":"IF(Data!J14=\"\",\"\",Data!J14)*1000","v":100},{"$f":"IF(Data!F14=\"\",\"\",Data!F14)","v":189.07},null,{"$f":"IF(ISNUMBER(A47+F47),(F47-A47)/A47,\"\")","v":0.04},{"$f":"IF(ISNUMBER(A47),F47-A47,\"\")","v":2},{"$f":"IF(Information!$M$3=\"mAs\",\"N/A\",IF(ISNUMBER(D47+G47),(G47-D47)/D47,\"\"))","v":0},null,{"$f":"IF(ISNUMBER(A47+F47),IF(ABS(J47)>ABS($N$43),\"FAIL\",\"PASS\"),\"\")","v":"PASS"},{"$f":"IF(OR(L47=\"N/A\", NOT(ISNUMBER(G47))),\"\",IF(ABS(L47)>ABS($O$43),\"FAIL\",\"PASS\"))","v":"PASS"}]
[60,100,"Small",100,2,{"$f":"IF(Data!D15=\"\",\"\",Data!D15)","v":57.1},{"$f":"IF(Data!J15=\"\",\"\",Data!J15)*1000","v":100},{"$f":"IF(Data!F15=\"\",\"\",Data!F15)","v":189.99},null,-4.8333333333333311E-2,-2.8999999999999986,{"$f":"IF(Information!$M$3=\"mAs\",\"N/A\",IF(ISNUMBER(D48+G48),(G48-D48)/D48,\"\"))","v":0},null,{"$f":"IF(ISNUMBER(A48+F48),IF(ABS(J48)>ABS($N$43),\"FAIL\",\"PASS\"),\"\")","v":"PASS"},{"$f":"IF(OR(L48=\"N/A\", NOT(ISNUMBER(G48))),\"\",IF(ABS(L48)>ABS($O$43),\"FAIL\",\"PASS\"))","v":"PASS"}]
[70,250,"Small",100,3,{"$f":"IF(Data!D16=\"\",\"\",Data!D16)","v":68.099999999999994},{"$f":"IF(Data!J16=\"\",\"\",Data!J16)*1000","v":100},{"$f":"IF(Data!F16=\"\",\"\",Data!F16)","v":187.56},null,-2.7142857142857225E-2,-1.9000000000000057,{"$f":"IF(Information!$M$3=\"mAs\",\"N/A\",IF(ISNUMBER(D49+G49),(G49-D49)/D49,\"\"))","v":0},null,"PASS","PASS"]
[80,250,"Small",100,4,{"$f":"IF(Data!D17=\"\",\"\",Data!D17)","v":78.7},{"$f":"IF(Data!J17=\"\",\"\",Data!J17)*1000","v":100},{"$f":"IF(Data!F17=\"\",\"\",Data!F17)","v":189.99},null,-1.6249999999999966E-2,-1.2999999999999972,{"$f":"IF(Information!$M$3=\"mAs\",\"N/A\",IF(ISNUMBER(D50+G50),(G50-D50)/D50,\"\"))","v":0},null,"PASS","PASS"]
[90,250,"Small",100,5,{"$f":"IF(Data!D18=\"\",\"\",Data!D18)","v":89.7},{"$f":"IF(Data!J18=\"\",\"\",Data!J18)*1000","v":100},{"$f":"IF(Data!F18=\"\",\"\",Data!F18)","v":189.07},null,-3.3333333333333019E-3,-0.29999999999999716,{"$f":"IF(Information!$M$3=\"mAs\",\"N/A\",IF(ISNUMBER(D51+G51),(G51-D51)/D51,\"\"))","v":0},null,"PASS","PASS"]
[100,250,"Large",100,6,{"$f":"IF(Data!D19=\"\",\"\",Data!D19)","v":99.1},{"$f":"IF(Data!J19=\"\",\"\",Data!J19)*1000","v":100},{"$f":"IF(Data!F19=\"\",\"\",Data!F19)","v":189.99},null,-9.0000000000000566E-3,-0.90000000000000568,{"$f":"IF(Information!$M$3=\"mAs\",\"N/A\",IF(ISNUMBER(D52+G52),(G52-D52)/D52,\"\"))","v":0},null,"PASS","PASS"]
[110,250,"Large",100,7,{"$f":"IF(Data!D20=\"\",\"\",Data!D20)","v":109.8},{"$f":"IF(Data!J20=\"\",\"\",Data!J20)*1000","v":100},{"$f":"IF(Data!F20=\"\",\"\",Data!F20)","v":187.56},null,-1.818181818181844E-3,-0.20000000000000284,{"$f":"IF(Information!$M$3=\"mAs\",\"N/A\",IF(ISNUMBER(D53+G53),(G53-D53)/D53,\"\"))","v":0},null,"PASS","PASS"]
[120,250,"Large",100,8,{"$f":"IF(Data!D21=\"\",\"\",Data!D21)","v":119.9},{"$f":"IF(Data!J21=\"\",\"\",Data!J21)*1000","v":100},{"$f":"IF(Data!F21=\"\",\"\",Data!F21)","v":189.99},null,-8.3333333333328601E-4,-9.9999999999994316E-2,{"$f":"IF(Information!$M$3=\"mAs\",\"N/A\",IF(ISNUMBER(D54+G54),(G54-D54)/D54,\"\"))","v":0},null,"PASS","PASS"]
[120,250,"Large",100,9,{"$f":"IF(Data!D22=\"\",\"\",Data!D22)","v":119.8},{"$f":"IF(Data!J22=\"\",\"\",Data!J22)*1000","v":100},{"$f":"IF(Data!F22=\"\",\"\",Data!F22)","v":189.07},null,-1.6666666666666904E-3,-0.20000000000000284,{"$f":"IF(Information!$M$3=\"mAs\",\"N/A\",IF(ISNUMBER(D55+G55),(G55-D55)/D55,\"\"))","v":0},null,"PASS","PASS"]
[120,250,"Large",100,10,{"$f":"IF(Data!D23=\"\",\"\",Data!D23)","v":119.9},{"$f":"IF(Data!J23=\"\",\"\",Data!J23)*1000","v":100},{"$f":"IF(Data!F23=\"\",\"\",Data!F23)","v":187.56},null,-8.3333333333328601E-4,-9.9999999999994316E-2,{"$f":"IF(Information!$M$3=\"mAs\",\"N/A\",IF(ISNUMBER(D56+G56),(G56-D56)/D56,\"\"))","v":0},null,"PASS","PASS"]
[null,null,null,null,null,null,null,null,null,null,{"$f":"IF(ISNUMBER(G57),(G57-B57)/B57,\"\")","v":""},{"$f":"IF(ISNUMBER(G57),G57-B57,\"\")","v":""}]
[]
[]
[null,null,null,null,null,null,null,null,null,40,{"$f":"N43","v":0.05}]
[null,null,null,null,null,null,null,null,null,140,{"$f":"N43","v":0.05}]
[null,null,null,null,null,null,null,null,null,40,-0.05]
[null,null,null,null,null,null,null,null,null,140,-0.05]
[]
[]
[]
[]
[]
[]
["Comments:"]
[]
["Signature:"]
["Page 2 of 3"]
["Radiographic mAs Linearity"]
[]
[null,"Facility:",{"$f":"Information!D8","v":"Confidential"},null,null,null,null,""]
[null,"Location:",{"$f":"Information!D10","v":"Top Secret"},null,null,null,null,""]
[null,"Room:",{"$f":"Information!D12","v":"Somewhere on the 3rd floor"}]
[null,"Machine:",{"$f":"Information!D14","v":"Pegasus 3000"}]
[null,"Technician:",{"$f":"Information!D16","v":"John Smith"}]
[null,"Date:",{"$f":"Information!D18","v":"5/4/1983"}]
[]
[null,null,null,null,"Measurement Data",null,null,null,"Results",null,null,null,"Machine Settings"]
[null,{"$f":"Information!D28","v":"mA"},"Focus","Exp.","kVp","ms",{"$f":"Information!D26","v":"mR/"},null,{"$f":"Information!D26 & Information!D28","v":"mR/mA"},"Deviation","Pass/Fail",null,"kVp","SDD"]
[null,25,"Small",1,{"$f":"IF(Data!D25=\"\",\"\",Data!D25)","v":79.3},{"$f":"IF(Data!J25=\"\",\"\",Data!J25)*1000","v":2003.6999999999998},{"$f":"IF(Data!F25=\"\",\"\",Data!F25)","v":275.92},null,{"$f":"IF(Information!$D$28=\"mA\",(IF(AND(ISNUMBER(G85), ISNUMBER(B85)),G85/(B85*(F85/1000)),\"\")),(IF(AND(ISNUMBER(G85),ISNUMBER(B85)),G85/B85,\"\")))","v":5.508209811848082},"N/A","-",null,80,{"$f":"Information!D22","v":12}]
[null,50,"Small",2,{"$f":"IF(Data!D26=\"\",\"\",Data!D26)","v":78},{"$f":"IF(Data!J26=\"\",\"\",Data!J26)*1000","v":1000},{"$f":"IF(Data!F26=\"\",\"\",Data!F26)","v":277.95},null,{"$f":"IF(Information!$D$28=\"mA\",(IF(AND(ISNUMBER(G86), ISNUMBER(B86)),G86/(B86*(F86/1000)),\"\")),(IF(AND(ISNUMBER(G86),ISNUMBER(B86)),G86/B86,\"\")))","v":5.5590000000000002},{"$f":"IF(ISNUMBER(I86),ABS((I86-I85)/(I86+I85)),\" \")","v":4.5892495954621146E-3},{"$f":"IF(ISNUMBER(J86),IF(ABS(J86)>ABS($M$88),\"FAIL\",\"PASS\"),0)","v":"PASS"}]
[null,100,"Small",3,{"$f":"IF(Data!D27=\"\",\"\",Data!D27)","v":77.2},{"$f":"IF(Data!J27=\"\",\"\",Data!J27)*1000","v":500},{"$f":"IF(Data!F27=\"\",\"\",Data!F27)","v":276.22000000000003},null,{"$f":"IF(Information!$D$28=\"mA\",(IF(AND(ISNUMBER(G87), ISNUMBER(B87)),G87/(B87*(F87/1000)),\"\")),(IF(AND(ISNUMBER(G87),ISNUMBER(B87)),G87/B87,\"\")))","v":5.5244000000000009},3.1217857336195837E-3,"PASS",null,"Pass/Fail Criteria"]
[null,160,"Small",4,{"$f":"IF(Data!D28=\"\",\"\",Data!D28)","v":77.8},{"$f":"IF(Data!J28=\"\",\"\",Data!J28)*1000","v":250},{"$f":"IF(Data!F28=\"\",\"\",Data!F28)","v":225.36},null,{"$f":"IF(Information!$D$28=\"mA\",(IF(AND(ISNUMBER(G88), ISNUMBER(B88)),G88/(B88*(F88/1000)),\"\")),(IF(AND(ISNUMBER(G88),ISNUMBER(B88)),G88/B88,\"\")))","v":5.6340000000000003},{"$f":"IF(ISNUMBER(I88),ABS((I88-I87)/(I88+I87)),\" \")","v":9.8221967307140327E-3},"PASS",null,0.05]
[null,250,"Large",5,{"$f":"IF(Data!D29=\"\",\"\",Data!D29)","v":78.5},{"$f":"IF(Data!J29=\"\",\"\",Data!J29)*1000","v":100},{"$f":"IF(Data!F29=\"\",\"\",Data!F29)","v":142.6},null,{"$f":"IF(Information!$D$28=\"mA\",(IF(AND(ISNUMBER(G89), ISNUMBER(B89)),G89/(B89*(F89/1000)),\"\")),(IF(AND(ISNUMBER(G89),ISNUMBER(B89)),G89/B89,\"\")))","v":5.7039999999999997},{"$f":"IF(ISNUMBER(I89),ABS((I89-I88)/(I89+I88)),\" \")","v":6.1739283824307099E-3},"PASS"]
[null,320,"Large",6,{"$f":"IF(Data!D30=\"\",\"\",Data!D30)","v":79.3},{"$f":"IF(Data!J30=\"\",\"\",Data!J30)*1000","v":100},{"$f":"IF(Data!F30=\"\",\"\",Data!F30)","v":189.07},null,{"$f":"IF(Information!$D$28=\"mA\",(IF(AND(ISNUMBER(G90), ISNUMBER(B90)),G90/(B90*(F90/1000)),\"\")),(IF(AND(ISNUMBER(G90),ISNUMBER(B90)),G90/B90,\"\")))","v":5.9084374999999998},1.7605046313489314E-2,"PASS"]
[null,320,"Large",7,{"$f":"IF(Data!D31=\"\",\"\",Data!D31)","v":79.599999999999994},{"$f":"IF(Data!J31=\"\",\"\",Data!J31)*1000","v":100},{"$f":"IF(Data!F31=\"\",\"\",Data!F31)","v":189.99},null,{"$f":"IF(Information!$D$28=\"mA\",(IF(AND(ISNUMBER(G91), ISNUMBER(B91)),G91/(B91*(F91/1000)),\"\")),(IF(AND(ISNUMBER(G91),ISNUMBER(B91)),G91/B91,\"\")))","v":5.9371875000000003},2.4270564026803564E-3,"PASS"]
[null,320,"Large",8,{"$f":"IF(Data!D32=\"\",\"\",Data!D32)","v":79.099999999999994},{"$f":"IF(Data!J32=\"\",\"\",Data!J32)*1000","v":100},{"$f":"IF(Data!F32=\"\",\"\",Data!F32)","v":187.56},null,{"$f":"IF(Information!$D$28=\"mA\",(IF(AND(ISNUMBER(G92), ISNUMBER(B92)),G92/(B92*(F92/1000)),\"\")),(IF(AND(ISNUMBER(G92),ISNUMBER(B92)),G92/B92,\"\")))","v":5.8612500000000001},6.4362336114422106E-3,"PASS"]
[null,320,"Large",9,{"$f":"IF(Data!D33=\"\",\"\",Data!D33)","v":79.3},{"$f":"IF(Data!J33=\"\",\"\",Data!J33)*1000","v":100},{"$f":"IF(Data!F33=\"\",\"\",Data!F33)","v":189.7},null,{"$f":"IF(Information!$D$28=\"mA\",(IF(AND(ISNUMBER(G93), ISNUMBER(B93)),G93/(B93*(F93/1000)),\"\")),(IF(AND(ISNUMBER(G93),ISNUMBER(B93)),G93/B93,\"\")))","v":5.9281249999999996},5.672480517415009E-3,"PASS"]
[null,null,null,null,null,null,null,null,"",{"$f":"IF(ISNUMBER(I94),ABS((I94-I93)/(I94+I93)),\" \")","v":" "},{"$f":"IF(ISNUMBER(J94),IF(ABS(J94)>ABS($J$11),\"FAIL\",\"PASS\"),0)","v":0}]
[null,null,null,null,null,null,null,null,"",{"$f":"IF(ISNUMBER(I95),ABS((I95-I94)/(I95+I94)),\" \")","v":" "},0]
[null,null,null,null,null,null,null,null,""," ",0]
[null,null,null,null,null,null,null,null,{"$f":"IF(ISNUMBER(#REF!),#REF!/(#REF!*#REF!),\"\")","v":""},{"$f":"IF(ISNUMBER(I97),ABS((I97-I96)/(I97+I96)),\" \")","v":" "}]
[]
[]
[]
[]
[null,null,null,null," "]
[]
[]
[]
[]
[]
[]
[]
[]
["Comments:"]
[]
["Signature:"]
["Page 3 of 3"]

{"sheet":"Sample Data","index":3,"n_rows":34,"n_cols":18,"rows_kept":34,"cut":false,"hidden":true,"merged":[]}
[79.3,"kV",189.07,"mR",1880.97,"mR/Sec",101.274,"ms",1,"Pulses",null,null,null,null,null,null,2,"mm-Al"]
[78,"kV",189.99,"mR",1891.05,"mR/Sec",101.35,"ms",1,"Pulses",null,null,null,null,null,null,2.2000000000000002,"mm-Al"]
[77.2,"kV",187.56,"mR",1868.85,"mR/Sec",100.85,"ms",1,"Pulses",null,null,null,null,null,null,2.7,"mm-Al"]
[77.8,"kV",189.99,"mR",1885.49,"mR/Sec",101.25,"ms",1,"Pulses",null,null,null,null,null,null,3,"mm-Al"]
[78.5,"kV",189.07,"mR",1880.97,"mR/Sec",101.1,"ms",1,"Pulses",null,null,null,null,null,null,3.4,"mm-Al"]
[79.3,"kV",189.99,"mR",1891.05,"mR/Sec",100.65900000000001,"ms",1,"Pulses",null,null,null,null,null,null,3.7,"mm-Al"]
[79.599999999999994,"kV",187.56,"mR",1868.85,"mR/Sec",101.68300000000001,"ms",1,"Pulses",null,null,null,null,null,null,4.0999999999999996,"mm-Al"]
[79.099999999999994,"kV",189.99,"mR",1885.49,"mR/Sec",101.581,"ms",1,"Pulses",null,null,null,null,null,null,4.5,"mm-Al"]
[79.5,"kV",189.07,"mR",1880.97,"mR/Sec",101.581,"ms",1,"Pulses",null,null,null,null,null,null,2,"mm-Al"]
[80.5,"kV",187.56,"mR",1891.05,"mR/Sec",100.85,"ms",1,"Pulses",null,null,null,null,null,null,2.2000000000000002,"mm-Al"]
[]
[52,"kV",189.07,"mR",1880.97,"mR/Sec",101.274,"ms",1,"Pulses",null,null,null,null,null,null,2,"mm-Al"]
[57.1,"kV",189.99,"mR",1891.05,"mR/Sec",101.35,"ms",1,"Pulses",null,null,null,null,null,null,2.2000000000000002,"mm-Al"]
[68.099999999999994,"kV",187.56,"mR",1868.85,"mR/Sec",100.85,"ms",1,"Pulses",null,null,null,null,null,null,2.7,"mm-Al"]
[78.7,"kV",189.99,"mR",1885.49,"mR/Sec",101.25,"ms",1,"Pulses",null,null,null,null,null,null,3,"mm-Al"]
[89.7,"kV",189.07,"mR",1880.97,"mR/Sec",101.1,"ms",1,"Pulses",null,null,null,null,null,null,3.4,"mm-Al"]
[99.1,"kV",189.99,"mR",1891.05,"mR/Sec",100.65900000000001,"ms",1,"Pulses",null,null,null,null,null,null,3.7,"mm-Al"]
[109.8,"kV",187.56,"mR",1868.85,"mR/Sec",101.68300000000001,"ms",1,"Pulses",null,null,null,null,null,null,4.0999999999999996,"mm-Al"]
[119.9,"kV",189.99,"mR",1885.49,"mR/Sec",101.581,"ms",1,"Pulses",null,null,null,null,null,null,4.5,"mm-Al"]
[119.8,"kV",189.07,"mR",1880.97,"mR/Sec",101.581,"ms",1,"Pulses",null,null,null,null,null,null,2,"mm-Al"]
[119.9,"kV",187.56,"mR",1891.05,"mR/Sec",100.85,"ms",1,"Pulses",null,null,null,null,null,null,2.2000000000000002,"mm-Al"]
[]
[80,"kV",189.07,"mR",1880.97,"mR/Sec",100,"ms",1,"Pulses",null,null,null,null,null,null,2,"mm-Al"]
[80,"kV",189.99,"mR",1891.05,"mR/Sec",100,"ms",1,"Pulses",null,null,null,null,null,null,2.2000000000000002,"mm-Al"]
[80,"kV",187.56,"mR",1868.85,"mR/Sec",100,"ms",1,"Pulses",null,null,null,null,null,null,2.7,"mm-Al"]
[80,"kV",189.99,"mR",1885.49,"mR/Sec",100,"ms",1,"Pulses",null,null,null,null,null,null,3,"mm-Al"]
[80,"kV",189.07,"mR",1880.97,"mR/Sec",100,"ms",1,"Pulses",null,null,null,null,null,null,3.4,"mm-Al"]
[80,"kV",189.99,"mR",1891.05,"mR/Sec",100,"ms",1,"Pulses",null,null,null,null,null,null,3.7,"mm-Al"]
[80,"kV",187.56,"mR",1868.85,"mR/Sec",101,"ms",1,"Pulses",null,null,null,null,null,null,4.0999999999999996,"mm-Al"]
[80,"kV",189.99,"mR",1885.49,"mR/Sec",100,"ms",1,"Pulses",null,null,null,null,null,null,4.5,"mm-Al"]
[80,"kV",189.07,"mR",1880.97,"mR/Sec",100,"ms",1,"Pulses",null,null,null,null,null,null,2,"mm-Al"]
[80,"kV",187.56,"mR",1891.05,"mR/Sec",100,"ms",1,"Pulses",null,null,null,null,null,null,2.2000000000000002,"mm-Al"]
[80,"kV",189.07,"mR",1880.97,"mR/Sec",100,"ms",1,"Pulses",null,null,null,null,null,null,2.7,"mm-Al"]
[80,"kV",187.56,"mR",1891.05,"mR/Sec",100,"ms",1,"Pulses",null,null,null,null,null,null,3,"mm-Al"]

{"sheet":"Data","index":4,"n_rows":144,"n_cols":85,"rows_kept":144,"cut":false,"hidden":false,"merged":[[1,61,1,62],[12,3,12,26],[23,3,23,26],[0,3,0,26],[1,3,1,4],[1,5,1,6],[1,7,1,8],[1,9,1,10],[1,11,1,12],[1,19,1,20]]}
[null,null,null,"Reproducibility"]
[null,null,"Exp.","kV",null,"Dose",null,"Dose-Rate",null,"Time",null,"Pulse Count",null,null,null,null,null,null,null,"HVL",null,null,null,null,"Serial #","Date","Time"]
["kV",{"$f":"Report!C11","v":80},1,79.3,"kV",189.07,"mR",1880.97,"mR/Sec",0.1,"ms",1,"Pulses",null,null,null,null,null,null,2,"mm-Al",null,"","1","43-0001","2017-04-27","14:40:20.089","","","","","","","","",null,"",3.694,"mm","mR",null,null,1,null,null,0.72740000000000005,"s",null,null,null,null,null,null,null,null,null,null,null,null,null,null,null,null,null,null,null,null,null,null,null,null,null,null,null,null,null,null,null,null,null,null,116.6,"kV",null,"43-0001"]
["mAs",{"$f":"Report!C12","v":20},2,78,"kV",189.99,"mR",1891.05,"mR/Sec",0.1,"ms",1,"Pulses",null,null,null,null,null,null,2.2000000000000002,"mm-Al",null,"","2","43-0001","2017-04-27","14:40:23.977","","","","","","","","",null,"",3.6930000000000001,"mm"]
["Focus",{"$f":"Report!C13","v":"Small"},3,77.2,"kV",187.56,"mR",1868.85,"mR/Sec",0.1,"ms",1,"Pulses",null,null,null,null,null,null,2.7,"mm-Al",null,null,3,"43-0001","2017-04-27","14:40:27.656",null,null,null,null,null,null,null,null,null,null,3.6930000000000001,"mm"]
["SDD",{"$f":"Report!C14","v":12},4,77.8,"kV",189.99,"mR",1885.49,"mR/Sec",0.1,"ms",1,"Pulses",null,null,null,null,null,null,3,"mm-Al"]
[null,null,5,78.5,"kV",189.07,"mR",1880.97,"mR/Sec",0.1,"ms",1,"Pulses",null,null,null,null,null,null,3.4,"mm-Al"]
[null,null,6,79.3,"kV",189.99,"mR",1891.05,"mR/Sec",0.1,"ms",1,"Pulses",null,null,null,null,null,null,3.7,"mm-Al"]
[null,null,7,79.599999999999994,"kV",187.56,"mR",1868.85,"mR/Sec",0.1,"ms",1,"Pulses",null,null,null,null,null,null,4.0999999999999996,"mm-Al"]
[null,null,8,79.099999999999994,"kV",189.99,"mR",1885.49,"mR/Sec",0.1,"ms",1,"Pulses",null,null,null,null,null,null,4.5,"mm-Al"]
[null,null,9,79.5,"kV",189.07,"mR",1880.97,"mR/Sec",0.1,"ms",1,"Pulses",null,null,null,null,null,null,2,"mm-Al"]
[null,null,10,80.5,"kV",187.56,"mR",1891.05,"mR/Sec",0.1,"ms",1,"Pulses",null,null,null,null,null,null,2.2000000000000002,"mm-Al"]
["kV",{"$f":"Report!B46","v":"mA"},"Exp.","Accuracy"]
[{"$f":"Report!A47","v":50},{"$f":"Report!B47","v":100},1,52,"kV",189.07,"mR",1880.97,"mR/Sec",0.1,"ms",1,"Pulses",null,null,null,null,null,null,2,"mm-Al",null,"","4","43-0001","2017-04-27","14:42:01.657","","","","","","","","",null,"",3.694,"mm"]
[{"$f":"Report!A48","v":60},{"$f":"Report!B48","v":100},2,57.1,"kV",189.99,"mR",1891.05,"mR/Sec",0.1,"ms",1,"Pulses",null,null,null,null,null,null,2.2000000000000002,"mm-Al",null,"","5","43-0001","2017-04-27","14:42:05.341","","","","","","","","",null,"",3.694,"mm"]
[{"$f":"Report!A49","v":70},{"$f":"Report!B49","v":250},3,68.099999999999994,"kV",187.56,"mR",1868.85,"mR/Sec",0.1,"ms",1,"Pulses",null,null,null,null,null,null,2.7,"mm-Al"]
[{"$f":"Report!A50","v":80},{"$f":"Report!B50","v":250},4,78.7,"kV",189.99,"mR",1885.49,"mR/Sec",0.1,"ms",1,"Pulses",null,null,null,null,null,null,3,"mm-Al"]
[{"$f":"Report!A51","v":90},{"$f":"Report!B51","v":250},5,89.7,"kV",189.07,"mR",1880.97,"mR/Sec",0.1,"ms",1,"Pulses",null,null,null,null,null,null,3.4,"mm-Al"]
[{"$f":"Report!A52","v":100},{"$f":"Report!B52","v":250},6,99.1,"kV",189.99,"mR",1891.05,"mR/Sec",0.1,"ms",1,"Pulses",null,null,null,null,null,null,3.7,"mm-Al"]
[{"$f":"Report!A53","v":110},{"$f":"Report!B53","v":250},7,109.8,"kV",187.56,"mR",1868.85,"mR/Sec",0.1,"ms",1,"Pulses",null,null,null,null,null,null,4.0999999999999996,"mm-Al"]
[{"$f":"Report!A54","v":120},{"$f":"Report!B54","v":250},8,119.9,"kV",189.99,"mR",1885.49,"mR/Sec",0.1,"ms",1,"Pulses",null,null,null,null,null,null,4.5,"mm-Al"]
[{"$f":"Report!A55","v":120},{"$f":"Report!B55","v":250},9,119.8,"kV",189.07,"mR",1880.97,"mR/Sec",0.1,"ms",1,"Pulses",null,null,null,null,null,null,2,"mm-Al"]
[{"$f":"Report!A56","v":120},{"$f":"Report!B56","v":250},10,119.9,"kV",187.56,"mR",1891.05,"mR/Sec",0.1,"ms",1,"Pulses",null,null,null,null,null,null,2.2000000000000002,"mm-Al"]
["mAs","Focus","Exp.","Linearity"]
[{"$f":"Report!B85","v":25},{"$f":"Report!C85","v":"Small"},1,79.3,"kV",275.92,"mR",137.93,"mR/Sec",2.0036999999999998,"ms",1,"Pulses",null,null,null,null,null,null,2,"mm-Al",null,"",1,"43-0001","2017-04-27","13:53:47.701"]
[{"$f":"Report!B86","v":50},{"$f":"Report!C86","v":"Small"},2,78,"kV",277.95,"mR",277.01,"mR/Sec",1,"ms",1,"Pulses",null,null,null,null,null,null,2.2000000000000002,"mm-Al"]
[{"$f":"Report!B87","v":100},{"$f":"Report!C87","v":"Small"},3,77.2,"kV",276.22000000000003,"mR",552.19000000000005,"mR/Sec",0.5,"ms",1,"Pulses",null,null,null,null,null,null,2.7,"mm-Al"]
[{"$f":"Report!B88","v":160},{"$f":"Report!C88","v":"Small"},4,77.8,"kV",225.36,"mR",899.75,"mR/Sec",0.25,"ms",1,"Pulses",null,null,null,null,null,null,3,"mm-Al"]
[{"$f":"Report!B89","v":250},{"$f":"Report!C89","v":"Large"},5,78.5,"kV",142.6,"mR",1431.98,"mR/Sec",0.1,"ms",1,"Pulses",null,null,null,null,null,null,3.4,"mm-Al"]
[{"$f":"Report!B90","v":320},{"$f":"Report!C90","v":"Large"},6,79.3,"kV",189.07,"mR",1880.97,"mR/Sec",0.1,"ms",1,"Pulses",null,null,null,null,null,null,3.7,"mm-Al"]
[{"$f":"Report!B91","v":320},{"$f":"Report!C91","v":"Large"},7,79.599999999999994,"kV",189.99,"mR",1891.05,"mR/Sec",0.1,"ms",1,"Pulses",null,null,null,null,null,null,4.0999999999999996,"mm-Al"]
[{"$f":"Report!B92","v":320},{"$f":"Report!C92","v":"Large"},8,79.099999999999994,"kV",187.56,"mR",1868.85,"mR/Sec",0.1,"ms",1,"Pulses",null,null,null,null,null,null,4.5,"mm-Al"]
[{"$f":"Report!B93","v":320},{"$f":"Report!C93","v":"Large"},9,79.3,"kV",189.7,"mR",1885.49,"mR/Sec",0.1,"ms",1,"Pulses",null,null,null,null,null,null,2,"mm-Al"]
[]
[]
[]
[]
[]
[]
[]
[]
[]
[]
[]
[]
[]
[]
[]
[]
[]
[]
[]
[]
[]
[]
[]
[]
[]
[]
[]
[]
[]
[]
[]
[]
[]
[]
[]
[]
[]
[]
[]
[]
[]
[]
[]
[]
[]
[]
[]
[]
[]
[]
[]
[]
[]
[]
[]
[]
[]
[]
[]
[]
[]
[]
[]
[]
[]
[]
[]
[]
[]
[]
[]
[]
[]
[]
[]
[]
[]
[]
[]
[]
[]
[]
[]
[]
[]
[]
[]
[]
[]
[]
[]
[]
[1,1,null,1,1,1,1,1,1,1,1,1,1,1,1,1,1,1,1,1,1,1,1,1,1,1,1,1]
[1,1,null,1,1,1,1,1,1,1,1,1,1,1,1,1,1,1,1,1,1,1,1,1,1,1,1,1]
[1,1,null,1,1,1,1,1,1,1,1,1,1,1,1,1,1,1,1,1,1,1,1,1,1,1,1,1]
[1,1,null,1,1,1,1,1,1,1,1,1,1,1,1,1,1,1,1,1,1,1,1,1,1,1,1,1]
[1,1,null,1,1,1,1,1,1,1,1,1,1,1,1,1,1,1,1,1,1,1,1,1,1,1,1,1]
[1,1,null,1,1,1,1,1,1,1,1,1,1,1,1,1,1,1,1,1,1,1,1,1,1,1,1,1]
[1,1,null,1,1,1,1,1,1,1,1,1,1,1,1,1,1,1,1,1,1,1,1,1,1,1,1,1]
[1,1,null,1,1,1,1,1,1,1,1,1,1,1,1,1,1,1,1,1,1,1,1,1,1,1,1,1]
[1,1,null,1,1,1,1,1,1,1,1,1,1,1,1,1,1,1,1,1,1,1,1,1,1,1,1,1]
[1,1,null,1,1,1,1,1,1,1,1,1,1,1,1,1,1,1,1,1,1,1,1,1,1,1,1,1]
[1,1,null,1,1,1,1,1,1,1,1,1,1,1,1,1,1,1,1,1,1,1,1,1,1,1,1,1]
[1,1,null,1,1,1,1,1,1,1,1,1,1,1,1,1,1,1,1,1,1,1,1,1,1,1,1,1]
[1,1,null,1,1,1,1,1,1,1,1,1,1,1,1,1,1,1,1,1,1,1,1,1,1,1,1,1]
[1,1,null,1,1,1,1,1,1,1,1,1,1,1,1,1,1,1,1,1,1,1,1,1,1,1,1,1]
[1,1,null,1,1,1,1,1,1,1,1,1,1,1,1,1,1,1,1,1,1,1,1,1,1,1,1,1]
[1,1,null,1,1,1,1,1,1,1,1,1,1,1,1,1,1,1,1,1,1,1,1,1,1,1,1,1]
[1,1,null,1,1,1,1,1,1,1,1,1,1,1,1,1,1,1,1,1,1,1,1,1,1,1,1,1]
[1,1,null,1,1,1,1,1,1,1,1,1,1,1,1,1,1,1,1,1,1,1,1,1,1,1,1,1]
[1,1,null,1,1,1,1,1,1,1,1,1,1,1,1,1,1,1,1,1,1,1,1,1,1,1,1,1]